Reaction Details
TargetcGMP-specific 3',5'-cyclic phosphodiesterase
LigandBDBM50065697
Substrate/Competitorn/a
Meas. Tech.ChEMBL_1464664 (CHEMBL3406685)
IC50 0.210000±n/a nM
Citation Sakamoto, TKoga, YHikota, MMatsuki, KMochida, HKikkawa, KFujishige, KKotera, JOmori, KMorimoto, HYamada, K 8-(3-chloro-4-methoxybenzyl)-8H-pyrido[2,3-d]pyrimidin-7-one derivatives as potent and selective phosphodiesterase 5 inhibitors. Bioorg Med Chem Lett25:1431-5 (2015) 
 
cGMP-specific 3',5'-cyclic phosphodiesterase
Name:cGMP-specific 3',5'-cyclic phosphodiesterase
Type:PROTEIN
Mol. Mass.:98285.03
Organism:Canis lupus familiaris
Description:ChEMBL_105565
Residue:865
BDBM50065697
NameBDBM50065697
Synonyms:CHEMBL3404016
TypeSmall organic molecule
Emp. Form.C27H31ClN4O6
Mol. Mass.543.011
SMILESCOc1ccc(CNc2nc(ncc2C(=O)c2cc(OC)c(OC)c(OC)c2)N2CCC[C@H]2CO)cc1Cl