Reaction Details
TargetTyrosine-protein kinase ABL1
LigandBDBM50066004
Substrate/Competitorn/a
Meas. Tech.ChEMBL_1464736 (CHEMBL3407087)
IC50>50000±n/a nM
Citation Mojzych, MKarczmarzyk, ZWysocki, WCeruso, MSupuran, CTKry?tof, VUrbanczyk-Lipkowska, ZKalicki, P New approaches to the synthesis of sildenafil analogues and their enzyme inhibitory activity. Bioorg Med Chem23:1421-9 (2015) 
 
Tyrosine-protein kinase ABL1
Name:Tyrosine-protein kinase ABL1
Type:Enzyme
Mol. Mass.:122897.30
Organism:Homo sapiens (Human)
Description:P00519
Residue:1130
BDBM50066004
NameBDBM50066004
Synonyms:CHEMBL3261394
TypeSmall organic molecule
Emp. Form.C20H27N7O4S
Mol. Mass.461.538
SMILESCCOc1ccc(cc1-c1nnc2n(C)nc(C)c2n1)S(=O)(=O)NCCN1CCOCC1