Reaction Details
TargetCarbonic anhydrase 9
LigandBDBM50066004
Substrate/Competitorn/a
Meas. Tech.ChEMBL_1464739 (CHEMBL3407090)
Ki 40±n/a nM
Citation Mojzych, MKarczmarzyk, ZWysocki, WCeruso, MSupuran, CTKry?tof, VUrbanczyk-Lipkowska, ZKalicki, P New approaches to the synthesis of sildenafil analogues and their enzyme inhibitory activity. Bioorg Med Chem23:1421-9 (2015) 
 
Carbonic anhydrase 9
Name:Carbonic anhydrase 9
Type:Enzyme
Mol. Mass.:49669.03
Organism:Homo sapiens (Human)
Description:Catalytic domain of human cloned isozyme was used in the assay
Residue:459
BDBM50066004
NameBDBM50066004
Synonyms:CHEMBL3261394
TypeSmall organic molecule
Emp. Form.C20H27N7O4S
Mol. Mass.461.538
SMILESCCOc1ccc(cc1-c1nnc2n(C)nc(C)c2n1)S(=O)(=O)NCCN1CCOCC1