Reaction Details
TargetCarbonic anhydrase 12
LigandBDBM50066006
Substrate/Competitorn/a
Meas. Tech.ChEMBL_1464740 (CHEMBL3407091)
Ki 7.3±n/a nM
Citation Mojzych, MKarczmarzyk, ZWysocki, WCeruso, MSupuran, CTKry?tof, VUrbanczyk-Lipkowska, ZKalicki, P New approaches to the synthesis of sildenafil analogues and their enzyme inhibitory activity. Bioorg Med Chem23:1421-9 (2015) 
 
Carbonic anhydrase 12
Name:Carbonic anhydrase 12
Type:Enzyme
Mol. Mass.:39456.00
Organism:Homo sapiens (Human)
Description:Catalytic domain of human cloned isozyme was used in the assay
Residue:354
BDBM50066006
NameBDBM50066006
Synonyms:CHEMBL3261395
TypeSmall organic molecule
Emp. Form.C16H20N6O4S
Mol. Mass.392.433
SMILESCCOc1ccc(cc1-c1nnc2n(C)nc(C)c2n1)S(=O)(=O)NCCO