Reaction Details
Target5-hydroxytryptamine receptor 7
LigandBDBM50403163
Substrate/Competitorn/a
Meas. Tech.ChEMBL_1464893 (CHEMBL3404182)
Ki 2.1±n/a nM
Citation Modica, MNIntagliata, SPittalą, VSalerno, LSiracusa, MACagnotto, ASalmona, MRomeo, G Synthesis and binding properties of new long-chain 4-substituted piperazine derivatives as 5-HT1A and 5-HT7 receptor ligands. Bioorg Med Chem Lett25:1427-30 (2015) 
 
5-hydroxytryptamine receptor 7
Name:5-hydroxytryptamine receptor 7
Type:G Protein-Coupled Receptor (GPCR)
Mol. Mass.:53573.08
Organism:Homo sapiens (Human)
Description:P34969
Residue:479
BDBM50403163
NameBDBM50403163
Synonyms:OXITRIPTAN
TypeSmall organic molecule
Emp. Form.C11H12N2O3
Mol. Mass.220.2246
SMILESN[C@@H](Cc1c[nH]c2ccc(O)cc12)C(O)=O