Reaction Details
Target5-hydroxytryptamine receptor 1A
LigandBDBM50066017
Substrate/Competitorn/a
Meas. Tech.ChEMBL_1464892 (CHEMBL3404181)
Ki 3.2±n/a nM
Citation Modica, MNIntagliata, SPittalą, VSalerno, LSiracusa, MACagnotto, ASalmona, MRomeo, G Synthesis and binding properties of new long-chain 4-substituted piperazine derivatives as 5-HT1A and 5-HT7 receptor ligands. Bioorg Med Chem Lett25:1427-30 (2015) 
 
5-hydroxytryptamine receptor 1A
Name:5-hydroxytryptamine receptor 1A
Type:n/a
Mol. Mass.:46122.49
Organism:Homo sapiens (Human)
Description:n/a
Residue:422
BDBM50066017
NameBDBM50066017
Synonyms:CHEMBL3401491
TypeSmall organic molecule
Emp. Form.C23H29ClN4OS
Mol. Mass.445.021
SMILESCc1sc2ncn(CCCCCN3CCN(CC3)c3cccc(Cl)c3)c(=O)c2c1C