Reaction Details
Target5-hydroxytryptamine receptor 1A
LigandBDBM50066019
Substrate/Competitorn/a
Meas. Tech.ChEMBL_1464892 (CHEMBL3404181)
Ki 1.0±n/a nM
Citation Modica, MNIntagliata, SPittalą, VSalerno, LSiracusa, MACagnotto, ASalmona, MRomeo, G Synthesis and binding properties of new long-chain 4-substituted piperazine derivatives as 5-HT1A and 5-HT7 receptor ligands. Bioorg Med Chem Lett25:1427-30 (2015) 
 
5-hydroxytryptamine receptor 1A
Name:5-hydroxytryptamine receptor 1A
Type:n/a
Mol. Mass.:46122.49
Organism:Homo sapiens (Human)
Description:n/a
Residue:422
BDBM50066019
NameBDBM50066019
Synonyms:CHEMBL3401493
TypeSmall organic molecule
Emp. Form.C25H34N4O2S
Mol. Mass.454.628
SMILESCCOc1ccccc1N1CCN(CCCCCn2cnc3sc(C)c(C)c3c2=O)CC1