Reaction Details
TargetCarbonic anhydrase 1
LigandBDBM26999
Substrate/Competitorn/a
Meas. Tech.ChEMBL_1465408 (CHEMBL3407116)
Ki 374±n/a nM
Citation Vullo, DDe Luca, VDel Prete, SCarginale, VScozzafava, ACapasso, CSupuran, CT Sulfonamide inhibition studies of theż-carbonic anhydrase from the Antarctic cyanobacterium Nostoc commune. Bioorg Med Chem23:1728-34 (2015) 
 
Carbonic anhydrase 1
Name:Carbonic anhydrase 1
Type:Enzyme
Mol. Mass.:28873.37
Organism:Homo sapiens (Human)
Description:P00915
Residue:261
BDBM26999
NameBDBM26999
Synonyms:4-(1,1-dioxo-1,2-thiazinan-2-yl)benzene-1-sulfonamide Contravul Sulthiame (SLT) | Sulthiame, 2
TypeSmall organic molecule
Emp. Form.C10H14N2O4S2
Mol. Mass.290.359
SMILESNS(=O)(=O)c1ccc(cc1)N1CCCCS1(=O)=O