Reaction Details
TargetCannabinoid receptor 1
LigandBDBM50389925
Substrate/Competitorn/a
Meas. Tech.ChEMBL_1465984 (CHEMBL3406966)
IC50 5740±n/a nM
Citation Nguyen, TGerman, NDecker, AMLi, JXWiley, JLThomas, BFKenakin, TPZhang, Y Structure-activity relationships of substituted 1H-indole-2-carboxamides as CB1 receptor allosteric modulators. Bioorg Med Chem23:2195-203 (2015) 
 
Cannabinoid receptor 1
Name:Cannabinoid receptor 1
Type:G Protein-Coupled Receptor (GPCR)
Mol. Mass.:52868.96
Organism:Homo sapiens (Human)
Description:P21554
Residue:472
BDBM50389925
NameBDBM50389925
Synonyms:CHEMBL2071060
TypeSmall organic molecule
Emp. Form.C19H18ClN3O3
Mol. Mass.371.818
SMILESCCc1c([nH]c2ccc(Cl)cc12)C(=O)NCCc1ccc(cc1)[N+]([O-])=O