Reaction Details
TargetCannabinoid receptor 1
LigandBDBM50066833
Substrate/Competitorn/a
Meas. Tech.ChEMBL_1465984 (CHEMBL3406966)
IC50 361±n/a nM
Citation Nguyen, TGerman, NDecker, AMLi, JXWiley, JLThomas, BFKenakin, TPZhang, Y Structure-activity relationships of substituted 1H-indole-2-carboxamides as CB1 receptor allosteric modulators. Bioorg Med Chem23:2195-203 (2015) 
 
Cannabinoid receptor 1
Name:Cannabinoid receptor 1
Type:G Protein-Coupled Receptor (GPCR)
Mol. Mass.:52868.96
Organism:Homo sapiens (Human)
Description:P21554
Residue:472
BDBM50066833
NameBDBM50066833
Synonyms:CHEMBL3401614
TypeSmall organic molecule
Emp. Form.C23H28FN3O
Mol. Mass.381.4863
SMILESCCN(CC)c1ccc(CCNC(=O)c2[nH]c3ccc(F)cc3c2CC)cc1