Reaction Details
TargetHigh affinity choline transporter 1
LigandBDBM87575
Substrate/Competitorn/a
Meas. Tech.ChEMBL_1464243 (CHEMBL3404110)
IC50 760±n/a nM
Citation Bollinger, SREngers, DWEnnis, EAWright, JLocuson, CWLindsley, CWBlakely, RDHopkins, CR Synthesis and structure-activity relationships of a series of 4-methoxy-3-(piperidin-4-yl)oxy benzamides as novel inhibitors of the presynaptic choline transporter. Bioorg Med Chem Lett25:1757-60 (2015) 
 
High affinity choline transporter 1
Name:High affinity choline transporter 1
Type:PROTEIN
Mol. Mass.:63194.33
Organism:Homo sapiens (Human)
Description:ChEMBL_1464247
Residue:580
BDBM87575
NameBDBM87575
Synonyms:MLS001126544 N-[(4,5-dimethyl-1,3-thiazol-2-yl)methyl]-4-methoxy-3-(1-propan-2-ylpiperidin-4-yl)oxybenzamide N-[(4,5-dimethylthiazol-2-yl)methyl]-3-[(1-isopropyl-4-piperidyl)oxy]-4-methoxy-benzamide cid_24793288
TypeSmall organic molecule
Emp. Form.C22H31N3O3S
Mol. Mass.417.565
SMILESCOc1ccc(cc1OC1CCN(CC1)C(C)C)C(=O)NCc1nc(C)c(C)s1