Reaction Details
TargetCytochrome P450 1A2
LigandBDBM50067209
Substrate/Competitorn/a
Meas. Tech.ChEMBL_1464251 (CHEMBL3404118)
IC50>30000±n/a nM
Citation Bollinger, SREngers, DWEnnis, EAWright, JLocuson, CWLindsley, CWBlakely, RDHopkins, CR Synthesis and structure-activity relationships of a series of 4-methoxy-3-(piperidin-4-yl)oxy benzamides as novel inhibitors of the presynaptic choline transporter. Bioorg Med Chem Lett25:1757-60 (2015) 
 
Cytochrome P450 1A2
Name:Cytochrome P450 1A2
Type:Enzyme
Mol. Mass.:58423.38
Organism:Homo sapiens (Human)
Description:P05177
Residue:516
BDBM50067209
NameBDBM50067209
Synonyms:CHEMBL3303792
TypeSmall organic molecule
Emp. Form.C22H31N3O4
Mol. Mass.401.4992
SMILESCOc1ccc(cc1OCCN1CCCCC1)C(=O)NCc1cc(no1)C(C)C