Reaction Details
TargetCytochrome P450 2D6
LigandBDBM50067206
Substrate/Competitorn/a
Meas. Tech.ChEMBL_1464253 (CHEMBL3404120)
IC50 27100±n/a nM
Citation Bollinger, SREngers, DWEnnis, EAWright, JLocuson, CWLindsley, CWBlakely, RDHopkins, CR Synthesis and structure-activity relationships of a series of 4-methoxy-3-(piperidin-4-yl)oxy benzamides as novel inhibitors of the presynaptic choline transporter. Bioorg Med Chem Lett25:1757-60 (2015) 
 
Cytochrome P450 2D6
Name:Cytochrome P450 2D6
Type:Protein
Mol. Mass.:55774.82
Organism:Homo sapiens (Human)
Description:P10635
Residue:497
BDBM50067206
NameBDBM50067206
Synonyms:CHEMBL3188567
TypeSmall organic molecule
Emp. Form.C24H33N3O3
Mol. Mass.411.5371
SMILESCOc1ccc(cc1OC1CCN(CC1)C(C)C)C(=O)NC(C)Cc1ccccn1