Reaction Details
TargetCeramide transfer protein
LigandBDBM50067351
Substrate/Competitorn/a
Meas. Tech.ChEMBL_1465154 (CHEMBL3405855)
EC50 159000±n/a nM
Citation Santos, CFleury, LRodriguez, FMarkus, JBerke?, DDaïch, AAusseil, FBaudoin-Dehoux, CBallereau, SGénisson, Y The CERT antagonist HPA-12: first practical synthesis and individual binding evaluation of the four stereoisomers. Bioorg Med Chem23:2004-9 (2015) 
 
Ceramide transfer protein
Name:Ceramide transfer protein
Type:PROTEIN
Mol. Mass.:70818.45
Organism:Homo sapiens (Human)
Description:ChEMBL_109569
Residue:624
BDBM50067351
NameBDBM50067351
Synonyms:CHEMBL3401791
TypeSmall organic molecule
Emp. Form.C22H37NO3
Mol. Mass.363.5341
SMILESCCCCCCCCCCCC(=O)N[C@H](CO)C[C@@H](O)c1ccccc1