Reaction Details
TargetRetinoic acid receptor alpha
LigandBDBM50067588
Substrate/Competitorn/a
Meas. Tech.ChEMBL_1466190 (CHEMBL3405114)
EC50 65±n/a nM
Citation Nakashima, KTanaka, TMurata, HKaburagi, KInoue, M Xanthones from the roots of Maclura cochinchinensis var. gerontogea and their retinoic acid receptor-a agonistic activity. Bioorg Med Chem Lett25:1998-2001 (2015) 
 
Retinoic acid receptor alpha
Name:Retinoic acid receptor alpha
Type:PROTEIN
Mol. Mass.:50778.87
Organism:Homo sapiens (Human)
Description:ChEMBL_1466191
Residue:462
BDBM50067588
NameBDBM50067588
Synonyms:CHEMBL3400677
TypeSmall organic molecule
Emp. Form.C23H22O6
Mol. Mass.394.4172
SMILESCC(C)(O)C1Cc2c(O1)ccc1oc3c4C=CC(C)(C)Oc4cc(O)c3c(=O)c21