Reaction Details
TargetCarbonic anhydrase 12
LigandBDBM50067981
Substrate/Competitorn/a
Meas. Tech.ChEMBL_1466434 (CHEMBL3406379)
Ki 51±n/a nM
Citation Bozdag, MCarta, FVullo, DAkdemir, AIsik, SLanzi, CScozzafava, AMasini, ESupuran, CT Synthesis of a new series of dithiocarbamates with effective human carbonic anhydrase inhibitory activity and antiglaucoma action. Bioorg Med Chem23:2368-76 (2015) 
 
Carbonic anhydrase 12
Name:Carbonic anhydrase 12
Type:Enzyme
Mol. Mass.:39456.00
Organism:Homo sapiens (Human)
Description:Catalytic domain of human cloned isozyme was used in the assay
Residue:354
BDBM50067981
NameBDBM50067981
Synonyms:CHEMBL3400156
TypeSmall organic molecule
Emp. Form.C7H9NNa2O2S2
Mol. Mass.249.261
SMILES[Na+].[Na+].[O-]C(=O)C1CCCCN1C([S-])=S