Reaction Details
TargetCarbonic anhydrase 12
LigandBDBM50067991
Substrate/Competitorn/a
Meas. Tech.ChEMBL_1466434 (CHEMBL3406379)
Ki 15±n/a nM
Citation Bozdag, MCarta, FVullo, DAkdemir, AIsik, SLanzi, CScozzafava, AMasini, ESupuran, CT Synthesis of a new series of dithiocarbamates with effective human carbonic anhydrase inhibitory activity and antiglaucoma action. Bioorg Med Chem23:2368-76 (2015) 
 
Carbonic anhydrase 12
Name:Carbonic anhydrase 12
Type:Enzyme
Mol. Mass.:39456.00
Organism:Homo sapiens (Human)
Description:Catalytic domain of human cloned isozyme was used in the assay
Residue:354
BDBM50067991
NameBDBM50067991
Synonyms:CHEMBL3400815
TypeSmall organic molecule
Emp. Form.C9H10NNaS2
Mol. Mass.219.302
SMILES[Na+].[S-]C(=S)NCCc1ccccc1