Reaction Details
TargetCarbonic anhydrase 9
LigandBDBM50067992
Substrate/Competitorn/a
Meas. Tech.ChEMBL_1466433 (CHEMBL3406378)
Ki 0.910000±n/a nM
Citation Bozdag, MCarta, FVullo, DAkdemir, AIsik, SLanzi, CScozzafava, AMasini, ESupuran, CT Synthesis of a new series of dithiocarbamates with effective human carbonic anhydrase inhibitory activity and antiglaucoma action. Bioorg Med Chem23:2368-76 (2015) 
 
Carbonic anhydrase 9
Name:Carbonic anhydrase 9
Type:Enzyme
Mol. Mass.:49669.03
Organism:Homo sapiens (Human)
Description:Catalytic domain of human cloned isozyme was used in the assay
Residue:459
BDBM50067992
NameBDBM50067992
Synonyms:CHEMBL3400816
TypeSmall organic molecule
Emp. Form.C9H11N2NaO2S3
Mol. Mass.298.381
SMILES[Na+].NS(=O)(=O)c1ccc(CCNC([S-])=S)cc1