Reaction Details
TargetCarbonic anhydrase 12
LigandBDBM50067997
Substrate/Competitorn/a
Meas. Tech.ChEMBL_1466434 (CHEMBL3406379)
Ki 91±n/a nM
Citation Bozdag, MCarta, FVullo, DAkdemir, AIsik, SLanzi, CScozzafava, AMasini, ESupuran, CT Synthesis of a new series of dithiocarbamates with effective human carbonic anhydrase inhibitory activity and antiglaucoma action. Bioorg Med Chem23:2368-76 (2015) 
 
Carbonic anhydrase 12
Name:Carbonic anhydrase 12
Type:Enzyme
Mol. Mass.:39456.00
Organism:Homo sapiens (Human)
Description:Catalytic domain of human cloned isozyme was used in the assay
Residue:354
BDBM50067997
NameBDBM50067997
Synonyms:CHEMBL3400801
TypeSmall organic molecule
Emp. Form.C8H13N2NaS2
Mol. Mass.224.322
SMILES[Na+].[S-]C(=S)NC1CN2CCC1CC2