Reaction Details
TargetCarbonic anhydrase 2
LigandBDBM50067948
Substrate/Competitorn/a
Meas. Tech.ChEMBL_1466432 (CHEMBL3406377)
Ki 30±n/a nM
Citation Bozdag, MCarta, FVullo, DAkdemir, AIsik, SLanzi, CScozzafava, AMasini, ESupuran, CT Synthesis of a new series of dithiocarbamates with effective human carbonic anhydrase inhibitory activity and antiglaucoma action. Bioorg Med Chem23:2368-76 (2015) 
 
Carbonic anhydrase 2
Name:Carbonic anhydrase 2
Type:Enzyme
Mol. Mass.:29250.71
Organism:Homo sapiens (Human)
Description:P00918
Residue:260
BDBM50067948
NameBDBM50067948
Synonyms:CHEMBL3400804
TypeSmall organic molecule
Emp. Form.C6H10KNS2
Mol. Mass.199.379
SMILES[K+].[S-]C(=S)N1CCCCC1