Reaction Details
TargetCarbonic anhydrase 2
LigandBDBM50067998
Substrate/Competitorn/a
Meas. Tech.ChEMBL_1466432 (CHEMBL3406377)
Ki 19±n/a nM
Citation Bozdag, MCarta, FVullo, DAkdemir, AIsik, SLanzi, CScozzafava, AMasini, ESupuran, CT Synthesis of a new series of dithiocarbamates with effective human carbonic anhydrase inhibitory activity and antiglaucoma action. Bioorg Med Chem23:2368-76 (2015) 
 
Carbonic anhydrase 2
Name:Carbonic anhydrase 2
Type:Enzyme
Mol. Mass.:29250.71
Organism:Homo sapiens (Human)
Description:P00918
Residue:260
BDBM50067998
NameBDBM50067998
Synonyms:CHEMBL3400802
TypeSmall organic molecule
Emp. Form.C8H13N2NaS2
Mol. Mass.224.322
SMILES[Na+].[S-]C(=S)N[C@H]1CN2CCC1CC2