Reaction Details
TargetCarbonic anhydrase 2
LigandBDBM50067994
Substrate/Competitorn/a
Meas. Tech.ChEMBL_1466432 (CHEMBL3406377)
Ki 42±n/a nM
Citation Bozdag, MCarta, FVullo, DAkdemir, AIsik, SLanzi, CScozzafava, AMasini, ESupuran, CT Synthesis of a new series of dithiocarbamates with effective human carbonic anhydrase inhibitory activity and antiglaucoma action. Bioorg Med Chem23:2368-76 (2015) 
 
Carbonic anhydrase 2
Name:Carbonic anhydrase 2
Type:Enzyme
Mol. Mass.:29250.71
Organism:Homo sapiens (Human)
Description:P00918
Residue:260
BDBM50067994
NameBDBM50067994
Synonyms:CHEMBL3400798
TypeSmall organic molecule
Emp. Form.C4H8KNOS2
Mol. Mass.189.341
SMILES[K+].OCCCNC([S-])=S