Reaction Details
TargetCarbonic anhydrase 2
LigandBDBM50067983
Substrate/Competitorn/a
Meas. Tech.ChEMBL_1466432 (CHEMBL3406377)
Ki 81±n/a nM
Citation Bozdag, MCarta, FVullo, DAkdemir, AIsik, SLanzi, CScozzafava, AMasini, ESupuran, CT Synthesis of a new series of dithiocarbamates with effective human carbonic anhydrase inhibitory activity and antiglaucoma action. Bioorg Med Chem23:2368-76 (2015) 
 
Carbonic anhydrase 2
Name:Carbonic anhydrase 2
Type:Enzyme
Mol. Mass.:29250.71
Organism:Homo sapiens (Human)
Description:P00918
Residue:260
BDBM50067983
NameBDBM50067983
Synonyms:CHEMBL3400807
TypeSmall organic molecule
Emp. Form.C7H9NNa2O2S2
Mol. Mass.249.261
SMILES[Na+].[Na+].[O-]C(=O)[C@@H]1CCCN(C1)C([S-])=S