Reaction Details
TargetCarbonic anhydrase 2
LigandBDBM50068120
Substrate/Competitorn/a
Meas. Tech.ChEMBL_1464059 (CHEMBL3406244)
Ki 58±n/a nM
Citation Yildirim, AAtmaca, UKeskin, ATopal, MÇelik, MGülçin, ISupuran, CT N-Acylsulfonamides strongly inhibit human carbonic anhydrase isoenzymes I and II. Bioorg Med Chem23:2598-605 (2015) 
 
Carbonic anhydrase 2
Name:Carbonic anhydrase 2
Type:Enzyme
Mol. Mass.:29250.71
Organism:Homo sapiens (Human)
Description:P00918
Residue:260
BDBM50068120
NameBDBM50068120
Synonyms:CHEMBL3402253
TypeSmall organic molecule
Emp. Form.C16H13Cl6NO7S
Mol. Mass.576.06
SMILESCc1ccc(cc1)S(=O)(=O)NC(=O)[C@@H]1[C@H](C(O)=O)[C@@]2(Cl)[C@@](O)(Cl)[C@](O)(Cl)[C@@]1(Cl)C2(Cl)Cl