Reaction Details
TargetTyrosine-protein kinase SYK
LigandBDBM50249090
Substrate/Competitorn/a
Meas. Tech.ChEMBL_1466564 (CHEMBL3407021)
Ki 96±n/a nM
Citation Argade, ABhamidipati, SLi, HCarroll, DClough, JKeim, HSylvain, CRossi, ABCoquilla, CIssakani, SDMasuda, ESPayan, DGSingh, R Application of cultured human mast cells (CHMC) for the design and structure-activity relationship of IgE-mediated mast cell activation inhibitors. Bioorg Med Chem Lett25:2117-21 (2015) 
 
Tyrosine-protein kinase SYK
Name:Tyrosine-protein kinase SYK
Type:Enzyme
Mol. Mass.:72079.99
Organism:Homo sapiens (Human)
Description:P43405
Residue:635
BDBM50249090
NameBDBM50249090
Synonyms:3,3'-(5-fluoropyrimidine-2,4-diyl)bis(azanediyl)diphenol | CHEMBL515271
TypeSmall organic molecule
Emp. Form.C16H13FN4O2
Mol. Mass.312.2984
SMILESOc1cccc(Nc2ncc(F)c(Nc3cccc(O)c3)n2)c1