Reaction Details
TargetTyrosine-protein phosphatase non-receptor type 11
LigandBDBM50068882
Substrate/Competitorn/a
Meas. Tech.ChEMBL_1466568 (CHEMBL3407025)
IC50 8250±n/a nM
Citation Chen, JGao, LXGong, JXJiang, CSYao, LGLi, JYLi, JXiao, WGuo, YW Design and synthesis of novel 1,2-dithiolan-4-yl benzoate derivatives as PTP1B inhibitors. Bioorg Med Chem Lett25:2211-6 (2015) 
 
Tyrosine-protein phosphatase non-receptor type 11
Name:Tyrosine-protein phosphatase non-receptor type 11
Type:Protein phosphatase
Mol. Mass.:68443.59
Organism:Homo sapiens (Human)
Description:Q06124
Residue:593
BDBM50068882
NameBDBM50068882
Synonyms:CHEMBL3402419
TypeSmall organic molecule
Emp. Form.C21H16Br2O4S2
Mol. Mass.556.287
SMILESBrc1ccc(Br)c(c1)C(=O)OCCC#Cc1ccc(cc1)C(=O)OC1CSSC1