Reaction Details
TargetTyrosine-protein phosphatase non-receptor type 2
LigandBDBM50068975
Substrate/Competitorn/a
Meas. Tech.ChEMBL_1466566 (CHEMBL3407023)
IC50 1880±n/a nM
Citation Chen, JGao, LXGong, JXJiang, CSYao, LGLi, JYLi, JXiao, WGuo, YW Design and synthesis of novel 1,2-dithiolan-4-yl benzoate derivatives as PTP1B inhibitors. Bioorg Med Chem Lett25:2211-6 (2015) 
 
Tyrosine-protein phosphatase non-receptor type 2
Name:Tyrosine-protein phosphatase non-receptor type 2
Type:Protein
Mol. Mass.:48481.80
Organism:Homo sapiens (Human)
Description:P17706
Residue:415
BDBM50068975
NameBDBM50068975
Synonyms:CHEMBL3402413
TypeSmall organic molecule
Emp. Form.C23H20Br2O4S2
Mol. Mass.584.341
SMILESBrc1ccc(Br)c(c1)C(=O)OCCCCC#Cc1ccc(cc1)C(=O)OC1CSSC1