Reaction Details
TargetNeurotensin receptor type 1
LigandBDBM50019417
Substrate/Competitorn/a
Meas. Tech.ChEMBL_1466612 (CHEMBL3407205)
Ki 1210±n/a nM
Citation Thomas, JBGiddings, AMOlepu, SWiethe, RWWarner, KRSarret, PLongpre, JMRunyon, SPGilmour, BP The amide linker in nonpeptide neurotensin receptor ligands plays a key role in calcium signaling at the neurotensin receptor type 2. Bioorg Med Chem Lett25:2060-4 (2015) 
 
Neurotensin receptor type 1
Name:Neurotensin receptor type 1
Type:PROTEIN
Mol. Mass.:47070.64
Organism:Rattus norvegicus
Description:ChEMBL_1466612
Residue:424
BDBM50019417
NameBDBM50019417
Synonyms:CHEMBL3290101
TypeSmall organic molecule
Emp. Form.C29H29N3O5
Mol. Mass.499.5577
SMILESCOc1cccc(OC)c1-c1cc(nn1-c1cccc2ccccc12)C(=O)NC1(CCCCC1)C(O)=O