Reaction Details
TargetCarbonic anhydrase
LigandBDBM13076
Substrate/Competitorn/a
Meas. Tech.ChEMBL_1466707 (CHEMBL3404500)
Ki 32±n/a nM
Citation Syrjänen, LKuuslahti, MTolvanen, MVullo, DParkkila, SSupuran, CT Theß-carbonic anhydrase from the malaria mosquito Anopheles gambiae is highly inhibited by sulfonamides. Bioorg Med Chem23:2303-9 (2015) 
 
Carbonic anhydrase
Name:Carbonic anhydrase
Type:PROTEIN
Mol. Mass.:29919.95
Organism:Anopheles gambiae
Description:ChEMBL_109570
Residue:255
BDBM13076
NameBDBM13076
Synonyms:6-chloro-1,1-dioxo-3,4-dihydro-2H-1,2,4-benzothiadiazine-7-sulfonamide Dichlothiazide Hydrochlorothiazide JFD00715 cid_3639
TypeSmall organic molecule
Emp. Form.C7H8ClN3O4S2
Mol. Mass.297.739
SMILESNS(=O)(=O)c1cc2c(NCNS2(=O)=O)cc1Cl