Reaction Details
TargetCarbonic anhydrase
LigandBDBM50013792
Substrate/Competitorn/a
Meas. Tech.ChEMBL_1466707 (CHEMBL3404500)
Ki 184±n/a nM
Citation Syrjänen, LKuuslahti, MTolvanen, MVullo, DParkkila, SSupuran, CT Theß-carbonic anhydrase from the malaria mosquito Anopheles gambiae is highly inhibited by sulfonamides. Bioorg Med Chem23:2303-9 (2015) 
 
Carbonic anhydrase
Name:Carbonic anhydrase
Type:PROTEIN
Mol. Mass.:29919.95
Organism:Anopheles gambiae
Description:ChEMBL_109570
Residue:255
BDBM50013792
NameBDBM50013792
Synonyms:CHEBI:6822 Neptazane
TypeSmall organic molecule
Emp. Form.C5H8N4O3S2
Mol. Mass.236.272
SMILESCC(=O)\N=c1\sc(nn1C)S(N)(=O)=O