Reaction Details
TargetAcetyl-CoA carboxylase 2
LigandBDBM50069756
Substrate/Competitorn/a
Meas. Tech.ChEMBL_1469477 (CHEMBL3412274)
IC50 1.7±n/a nM
Citation Bourbeau, MPBartberger, MD Recent advances in the development of acetyl-CoA carboxylase (ACC) inhibitors for the treatment of metabolic disease. J Med Chem58:525-36 (2015) 
 
Acetyl-CoA carboxylase 2
Name:Acetyl-CoA carboxylase 2
Type:Protein
Mol. Mass.:276535.21
Organism:Homo sapiens (Human)
Description:O00763
Residue:2458
BDBM50069756
NameBDBM50069756
Synonyms:CHEMBL3407547 ND-630 US10995099, Example 38 | US11186587, Example ND-630
TypeSmall organic molecule
Emp. Form.C28H31N3O8S
Mol. Mass.569.626
SMILESCOc1ccccc1[C@H](Cn1c2sc(c(C)c2c(=O)n(c1=O)C(C)(C)C(O)=O)-c1ncco1)OC1CCOCC1