Reaction Details
TargetAcetylcholinesterase
LigandBDBM50069807
Substrate/Competitorn/a
Meas. Tech.ChEMBL_1469747 (CHEMBL3413435)
IC50 15400±n/a nM
Citation Bautista-Aguilera, OMSamadi, AChioua, MNikolic, KFilipic, SAgbaba, DSoriano, Ede Andrés, LRodríguez-Franco, MIAlcaro, SRamsay, RROrtuso, FYañez, MMarco-Contelles, J N-Methyl-N-((1-methyl-5-(3-(1-(2-methylbenzyl)piperidin-4-yl)propoxy)-1H-indol-2-yl)methyl)prop-2-yn-1-amine, a new cholinesterase and monoamine oxidase dual inhibitor. J Med Chem57:10455-63 (2014) 
 
Acetylcholinesterase
Name:Acetylcholinesterase
Type:Enzyme
Mol. Mass.:67792.70
Organism:Homo sapiens (Human)
Description:P22303
Residue:614
BDBM50069807
NameBDBM50069807
Synonyms:CHEMBL3407583
TypeSmall organic molecule
Emp. Form.C28H35N3O
Mol. Mass.429.597
SMILESCN(CC#C)Cc1cc2cc(OCCCC3CCN(Cc4ccccc4)CC3)ccc2[nH]1