Reaction Details
TargetAcetylcholinesterase
LigandBDBM36552
Substrate/Competitorn/a
Meas. Tech.ChEMBL_1469747 (CHEMBL3413435)
IC50 520±n/a nM
Citation Bautista-Aguilera, OMSamadi, AChioua, MNikolic, KFilipic, SAgbaba, DSoriano, Ede Andrés, LRodríguez-Franco, MIAlcaro, SRamsay, RROrtuso, FYañez, MMarco-Contelles, J N-Methyl-N-((1-methyl-5-(3-(1-(2-methylbenzyl)piperidin-4-yl)propoxy)-1H-indol-2-yl)methyl)prop-2-yn-1-amine, a new cholinesterase and monoamine oxidase dual inhibitor. J Med Chem57:10455-63 (2014) 
 
Acetylcholinesterase
Name:Acetylcholinesterase
Type:Enzyme
Mol. Mass.:67792.70
Organism:Homo sapiens (Human)
Description:P22303
Residue:614
BDBM36552
NameBDBM36552
Synonyms:Prochelators, 2
TypeSmall organic molecule
Emp. Form.C17H19N3O2
Mol. Mass.297.3517
SMILESCN(CC#C)Cc1ccc(OC(=O)N(C)C)c2ncccc12