Reaction Details
TargetThymidylate synthase
LigandBDBM50070036
Substrate/Competitorn/a
Meas. Tech.ChEMBL_1469979 (CHEMBL3411864)
IC50 300000±n/a nM
Citation Tochowicz, ASantucci, MSaxena, PGuaitoli, GTrande, MFiner-Moore, JStroud, RMCosti, MP Alanine mutants of the interface residues of human thymidylate synthase decode key features of the binding mode of allosteric anticancer peptides. J Med Chem58:1012-8 (2015) 
 
Thymidylate synthase
Name:Thymidylate synthase
Type:Enzyme
Mol. Mass.:35718.07
Organism:Homo sapiens (Human)
Description:n/a
Residue:313
BDBM50070036
NameBDBM50070036
Synonyms:CHEMBL3407794
TypeSmall organic molecule
Emp. Form.C34H58N10O15S
Mol. Mass.878.947
SMILESCC(C)C[C@H](NC(=O)[C@H](CCC(O)=O)NC(=O)[C@H](CO)NC(=O)[C@H](CC(N)=O)NC(=O)[C@@H](N)C(C)C)C(=O)N[C@@H](CO)C(=O)N[C@@H](CS)C(=O)N[C@@H](CCC(N)=O)C(O)=O