Reaction Details
TargetThymidylate synthase
LigandBDBM50070032
Substrate/Competitorn/a
Meas. Tech.ChEMBL_1469981 (CHEMBL3411866)
IC50 30000±n/a nM
Citation Tochowicz, ASantucci, MSaxena, PGuaitoli, GTrande, MFiner-Moore, JStroud, RMCosti, MP Alanine mutants of the interface residues of human thymidylate synthase decode key features of the binding mode of allosteric anticancer peptides. J Med Chem58:1012-8 (2015) 
 
Thymidylate synthase
Name:Thymidylate synthase
Type:Enzyme
Mol. Mass.:35718.07
Organism:Homo sapiens (Human)
Description:n/a
Residue:313
BDBM50070032
NameBDBM50070032
Synonyms:CHEMBL3407790
TypeSmall organic molecule
Emp. Form.C40H63N9O15S
Mol. Mass.942.045
SMILESCC(C)C[C@H](NC(=O)[C@H](CCC(O)=O)NC(=O)[C@@H](N)CO)C(=O)N[C@@H](CO)C(=O)N[C@@H](CS)C(=O)N[C@@H](CCC(N)=O)C(=O)N[C@@H](CC(C)C)C(=O)N[C@@H](Cc1ccc(O)cc1)C(O)=O