Reaction Details
TargetThymidylate synthase
LigandBDBM50070033
Substrate/Competitorn/a
Meas. Tech.ChEMBL_1469981 (CHEMBL3411866)
IC50 71000±n/a nM
Citation Tochowicz, ASantucci, MSaxena, PGuaitoli, GTrande, MFiner-Moore, JStroud, RMCosti, MP Alanine mutants of the interface residues of human thymidylate synthase decode key features of the binding mode of allosteric anticancer peptides. J Med Chem58:1012-8 (2015) 
 
Thymidylate synthase
Name:Thymidylate synthase
Type:Enzyme
Mol. Mass.:35718.07
Organism:Homo sapiens (Human)
Description:n/a
Residue:313
BDBM50070033
NameBDBM50070033
Synonyms:CHEMBL3407791
TypeSmall organic molecule
Emp. Form.C45H64N10O15
Mol. Mass.985.0477
SMILESCC(C)[C@H](NC(=O)[C@@H](NC(=O)[C@H](Cc1ccc(O)cc1)NC(=O)[C@H](Cc1ccccc1)NC(=O)[C@@H](N)CCC(N)=O)C(C)C)C(=O)N[C@@H](CC(N)=O)C(=O)N[C@@H](CO)C(=O)N[C@@H](CCC(O)=O)C(O)=O