Reaction Details
TargetThymidylate synthase
LigandBDBM50070027
Substrate/Competitorn/a
Meas. Tech.ChEMBL_1469983 (CHEMBL3411868)
Ki 78000±n/a nM
Citation Tochowicz, ASantucci, MSaxena, PGuaitoli, GTrande, MFiner-Moore, JStroud, RMCosti, MP Alanine mutants of the interface residues of human thymidylate synthase decode key features of the binding mode of allosteric anticancer peptides. J Med Chem58:1012-8 (2015) 
 
Thymidylate synthase
Name:Thymidylate synthase
Type:Enzyme
Mol. Mass.:35718.07
Organism:Homo sapiens (Human)
Description:n/a
Residue:313
BDBM50070027
NameBDBM50070027
Synonyms:CHEMBL3407789
TypeSmall organic molecule
Emp. Form.C39H63N13O13S
Mol. Mass.954.062
SMILESCC(C)C[C@H](NC(=O)[C@H](CCC(N)=O)NC(=O)[C@@H](N)CS)C(=O)N[C@@H](Cc1ccc(O)cc1)C(=O)N[C@@H](CCC(N)=O)C(=O)N[C@@H](CCCNC(N)=N)C(=O)N[C@@H](CO)C(=O)NCC(O)=O