Reaction Details
TargetFatty acid synthase
LigandBDBM50241342
Substrate/Competitorn/a
Meas. Tech.ChEMBL_1467001 (CHEMBL3411198)
Ki 4100±n/a nM
Citation Fako, VEWu, XPflug, BLiu, JYZhang, JT Repositioning proton pump inhibitors as anticancer drugs by targeting the thioesterase domain of human fatty acid synthase. J Med Chem58:778-84 (2015) 
 
Fatty acid synthase
Name:Fatty acid synthase
Type:Enzyme
Mol. Mass.:273419.37
Organism:Homo sapiens (Human)
Description:P49327
Residue:2511
BDBM50241342
NameBDBM50241342
Synonyms:5-(difluoromethoxy)-2-((3,4-dimethoxypyridin-2-yl)methylsulfinyl)-1H-benzo[d]imidazole 6-(difluoromethoxy)-2-((3,4-dimethoxypyridin-2-yl)methylsulfinyl)-1H-benzo[d]imidazole CHEMBL1502 Protonix SK-96022
TypeSmall organic molecule
Emp. Form.C16H15F2N3O4S
Mol. Mass.383.37
SMILESCOc1ccnc(CS(=O)c2nc3ccc(OC(F)F)cc3[nH]2)c1OC