Reaction Details
TargetCarbonic anhydrase 9
LigandBDBM50070606
Substrate/Competitorn/a
Meas. Tech.ChEMBL_1468135 (CHEMBL3414021)
Ki 6.0±n/a nM
Citation Haider, SAlam, MSHamid, H 1,3,4-Thiadiazoles: a potent multi targeted pharmacological scaffold. Eur J Med Chem92:156-77 (2015) 
 
Carbonic anhydrase 9
Name:Carbonic anhydrase 9
Type:Enzyme
Mol. Mass.:49669.03
Organism:Homo sapiens (Human)
Description:Catalytic domain of human cloned isozyme was used in the assay
Residue:459
BDBM50070606
NameBDBM50070606
Synonyms:CHEMBL3408993
TypeSmall organic molecule
Emp. Form.C13H12ClN5O8S3
Mol. Mass.497.911
SMILES[O-][Cl](=O)(=O)=O.NS(=O)(=O)c1nnc(NS(=O)(=O)c2ccc(cc2)-[n+]2ccccc2)s1