Reaction Details
TargetD(2) dopamine receptor
LigandBDBM50070829
Substrate/Competitorn/a
Meas. Tech.ChEMBL_1468595 (CHEMBL3413541)
Ki 6.1±n/a nM
Citation Kolaczkowski, MMarcinkowska, MBucki, ASniecikowska, JPawlowski, MKazek, GSiwek, AJastrzebska-Wiesek, MPartyka, AWasik, AWesolowska, AMierzejewski, PBienkowski, P Novel 5-HT6 receptor antagonists/D2 receptor partial agonists targeting behavioral and psychological symptoms of dementia. Eur J Med Chem92:221-35 (2015) 
 
D(2) dopamine receptor
Name:D(2) dopamine receptor
Type:Cell-surface receptors
Mol. Mass.:50647.10
Organism:Homo sapiens (Human)
Description:P14416
Residue:443
BDBM50070829
NameBDBM50070829
Synonyms:CHEMBL3409240
TypeSmall organic molecule
Emp. Form.C32H35FN4O2
Mol. Mass.526.6443
SMILESFc1cccc(Cn2ccc3c(cccc23)N2CCN(CCCCOc3ccc4CCC(=O)Nc4c3)CC2)c1