Reaction Details
TargetD(2) dopamine receptor
LigandBDBM50070895
Substrate/Competitorn/a
Meas. Tech.ChEMBL_1468595 (CHEMBL3413541)
Ki 14±n/a nM
Citation Kolaczkowski, MMarcinkowska, MBucki, ASniecikowska, JPawlowski, MKazek, GSiwek, AJastrzebska-Wiesek, MPartyka, AWasik, AWesolowska, AMierzejewski, PBienkowski, P Novel 5-HT6 receptor antagonists/D2 receptor partial agonists targeting behavioral and psychological symptoms of dementia. Eur J Med Chem92:221-35 (2015) 
 
D(2) dopamine receptor
Name:D(2) dopamine receptor
Type:Cell-surface receptors
Mol. Mass.:50647.10
Organism:Homo sapiens (Human)
Description:P14416
Residue:443
BDBM50070895
NameBDBM50070895
Synonyms:CHEMBL3407518
TypeSmall organic molecule
Emp. Form.C32H35N3O4S
Mol. Mass.557.703
SMILESO=C1CCc2ccc(OCCCCN3CCC(CC3)c3cn(c4ccccc34)S(=O)(=O)c3ccccc3)cc2N1