Reaction Details
Target5-hydroxytryptamine receptor 6
LigandBDBM50070899
Substrate/Competitorn/a
Meas. Tech.ChEMBL_1468594 (CHEMBL3413540)
Ki 6.9±n/a nM
Citation Kolaczkowski, MMarcinkowska, MBucki, ASniecikowska, JPawlowski, MKazek, GSiwek, AJastrzebska-Wiesek, MPartyka, AWasik, AWesolowska, AMierzejewski, PBienkowski, P Novel 5-HT6 receptor antagonists/D2 receptor partial agonists targeting behavioral and psychological symptoms of dementia. Eur J Med Chem92:221-35 (2015) 
 
5-hydroxytryptamine receptor 6
Name:5-hydroxytryptamine receptor 6
Type:G Protein-Coupled Receptor (GPCR)
Mol. Mass.:46968.43
Organism:Homo sapiens (Human)
Description:P50406
Residue:440
BDBM50070899
NameBDBM50070899
Synonyms:CHEMBL3409263
TypeSmall organic molecule
Emp. Form.C28H30FN3O3S
Mol. Mass.507.62
SMILESFc1ccc(OCCCCN2CCN(CC2)c2cccc3n(ccc23)S(=O)(=O)c2ccccc2)cc1