Reaction Details
Target5-hydroxytryptamine receptor 6
LigandBDBM50070904
Substrate/Competitorn/a
Meas. Tech.ChEMBL_1468594 (CHEMBL3413540)
Ki 1.7±n/a nM
Citation Kolaczkowski, MMarcinkowska, MBucki, ASniecikowska, JPawlowski, MKazek, GSiwek, AJastrzebska-Wiesek, MPartyka, AWasik, AWesolowska, AMierzejewski, PBienkowski, P Novel 5-HT6 receptor antagonists/D2 receptor partial agonists targeting behavioral and psychological symptoms of dementia. Eur J Med Chem92:221-35 (2015) 
 
5-hydroxytryptamine receptor 6
Name:5-hydroxytryptamine receptor 6
Type:G Protein-Coupled Receptor (GPCR)
Mol. Mass.:46968.43
Organism:Homo sapiens (Human)
Description:P50406
Residue:440
BDBM50070904
NameBDBM50070904
Synonyms:CHEMBL3409258
TypeSmall organic molecule
Emp. Form.C30H35N3O4S
Mol. Mass.533.682
SMILESCC(C)Oc1ccccc1OCCCN1CCN(CC1)c1cccc2n(ccc12)S(=O)(=O)c1ccccc1