Reaction Details
TargetDihydroorotate dehydrogenase (quinone), mitochondrial
LigandBDBM50018011
Substrate/Competitorn/a
Meas. Tech.ChEMBL_1468793 (CHEMBL3411803)
IC50 5012±n/a nM
Citation Munier-Lehmann, HLucas-Hourani, MGuillou, SHelynck, OZanghi, GNoel, ATangy, FVidalain, POJanin, YL Original 2-(3-alkoxy-1H-pyrazol-1-yl)pyrimidine derivatives as inhibitors of human dihydroorotate dehydrogenase (DHODH). J Med Chem58:860-77 (2015) 
 
Dihydroorotate dehydrogenase (quinone), mitochondrial
Name:Dihydroorotate dehydrogenase (quinone), mitochondrial
Type:Enzyme
Mol. Mass.:42881.33
Organism:Homo sapiens (Human)
Description:Q02127
Residue:395
BDBM50018011
NameBDBM50018011
Synonyms:Aubagio HMR-1726 | TERIFLUNOMIDE
TypeSmall organic molecule
Emp. Form.C12H9F3N2O2
Mol. Mass.270.2073
SMILESC\C(O)=C(/C#N)C(=O)Nc1ccc(cc1)C(F)(F)F