Reaction Details
TargetThermolysin
LigandBDBM50070920
Substrate/Competitorn/a
Meas. Tech.ChEMBL_1468794 (CHEMBL3411804)
Ki 40±n/a nM
Citation Nasief, NNHangauer, D Additivity or cooperativity: which model can predict the influence of simultaneous incorporation of two or more functionalities in a ligand molecule? Eur J Med Chem90:897-915 (2015) 
 
Thermolysin
Name:Thermolysin
Type:PROTEIN
Mol. Mass.:60097.54
Organism:Bacillus thermoproteolyticus
Description:ChEMBL_1468794
Residue:548
BDBM50070920
NameBDBM50070920
Synonyms:CHEMBL3409526
TypeSmall organic molecule
Emp. Form.C22H34Li2N3O7P
Mol. Mass.497.377
SMILES[Li+].[Li+].CC(C)C[C@H](NP([O-])(=O)CNC(=O)OCc1ccccc1)C(=O)N[C@@H](CC(C)(C)C)C([O-])=O