Reaction Details
TargetThermolysin
LigandBDBM50070931
Substrate/Competitorn/a
Meas. Tech.ChEMBL_1468794 (CHEMBL3411804)
Ki 26±n/a nM
Citation Nasief, NNHangauer, D Additivity or cooperativity: which model can predict the influence of simultaneous incorporation of two or more functionalities in a ligand molecule? Eur J Med Chem90:897-915 (2015) 
 
Thermolysin
Name:Thermolysin
Type:PROTEIN
Mol. Mass.:60097.54
Organism:Bacillus thermoproteolyticus
Description:ChEMBL_1468794
Residue:548
BDBM50070931
NameBDBM50070931
Synonyms:CHEMBL3409516
TypeSmall organic molecule
Emp. Form.C20H33LiN3O5P
Mol. Mass.433.408
SMILES[Li+].CCC(C)CNC(=O)[C@H](CC(C)C)NP([O-])(=O)CNC(=O)OCc1ccccc1