Reaction Details
TargetThermolysin
LigandBDBM50070938
Substrate/Competitorn/a
Meas. Tech.ChEMBL_1468794 (CHEMBL3411804)
Ki 29±n/a nM
Citation Nasief, NNHangauer, D Additivity or cooperativity: which model can predict the influence of simultaneous incorporation of two or more functionalities in a ligand molecule? Eur J Med Chem90:897-915 (2015) 
 
Thermolysin
Name:Thermolysin
Type:PROTEIN
Mol. Mass.:60097.54
Organism:Bacillus thermoproteolyticus
Description:ChEMBL_1468794
Residue:548
BDBM50070938
NameBDBM50070938
Synonyms:CHEMBL3409509
TypeSmall organic molecule
Emp. Form.C20H30Li2N3O7P
Mol. Mass.469.324
SMILES[Li+].[Li+].CCC[C@H](NP([O-])(=O)CNC(=O)OCc1ccccc1)C(=O)N[C@@H](CC(C)C)C([O-])=O