Reaction Details
TargetProtein arginine N-methyltransferase 5
LigandBDBM50070950
Substrate/Competitorn/a
Meas. Tech.ChEMBL_1468799 (CHEMBL3411809)
IC50 35400±n/a nM
Citation Hu, HOwens, EASu, HYan, LLevitz, AZhao, XHenary, MZheng, YG Exploration of cyanine compounds as selective inhibitors of protein arginine methyltransferases: synthesis and biological evaluation. J Med Chem58:1228-43 (2015) 
 
Protein arginine N-methyltransferase 5
Name:Protein arginine N-methyltransferase 5
Type:Enzyme
Mol. Mass.:72679.99
Organism:Homo sapiens (Human)
Description:O14744
Residue:637
BDBM50070950
NameBDBM50070950
Synonyms:CHEMBL3409562
TypeSmall organic molecule
Emp. Form.C33H40Br3IN2
Mol. Mass.831.301
SMILES[I-].CCCCN1\C(=C\C=C(/Br)\C=C\C2=[N+](CCCC)c3ccc(Br)cc3C2(C)C)C(C)(C)c2cc(Br)ccc12