Reaction Details
TargetPantothenate kinase 1
LigandBDBM50071449
Substrate/Competitorn/a
Meas. Tech.ChEMBL_1469796 (CHEMBL3413790)
IC50 190±n/a nM
Citation Sharma, LKLeonardi, RLin, WBoyd, VAGoktug, AShelat, AAChen, TJackowski, SRock, CO A high-throughput screen reveals new small-molecule activators and inhibitors of pantothenate kinases. J Med Chem58:1563-8 (2015) 
 
Pantothenate kinase 1
Name:Pantothenate kinase 1
Type:PROTEIN
Mol. Mass.:64345.71
Organism:Homo sapiens (Human)
Description:ChEMBL_109585
Residue:598
BDBM50071449
NameBDBM50071449
Synonyms:CHEMBL3410398
TypeSmall organic molecule
Emp. Form.C21H18F3N5O
Mol. Mass.413.3957
SMILESCc1nc2c3cccnc3nn2c(C)c1CCC(=O)Nc1cccc(c1)C(F)(F)F