Reaction Details
TargetPantothenate kinase 3
LigandBDBM50071454
Substrate/Competitorn/a
Meas. Tech.ChEMBL_1469797 (CHEMBL3413791)
IC50 180±n/a nM
Citation Sharma, LKLeonardi, RLin, WBoyd, VAGoktug, AShelat, AAChen, TJackowski, SRock, CO A high-throughput screen reveals new small-molecule activators and inhibitors of pantothenate kinases. J Med Chem58:1563-8 (2015) 
 
Pantothenate kinase 3
Name:Pantothenate kinase 3
Type:PROTEIN
Mol. Mass.:41093.59
Organism:Homo sapiens (Human)
Description:ChEMBL_109587
Residue:370
BDBM50071454
NameBDBM50071454
Synonyms:CHEMBL3410244
TypeSmall organic molecule
Emp. Form.C16H22N2O3S
Mol. Mass.322.422
SMILESCCS(=O)(=O)Nc1ccc(cc1)C(=O)NC1CC2CCC1C2